martin700
20-12-2004, 21:55
Hello
after using my WL-HDD for 2 weeks, I turned to modifying the firmware.
I unpacked the source under Suse 9.1 in my /usr/local/src Directory and corrected all missing links. I also added the ....../bin and ..../lib path to my PATH.
When I run make I keep getting this error:
make[2]: Entering directory `/usr/local/src/broadcom/src/pmon/lib'
mipsel-linux-gcc -EL -G 0 -DMIPSEL -mno-abicalls -fno-pic -mcpu=r4600 -mips2 -Ulinux -fno-builtin -Os -nostdinc -I/usr/local/src/broadcom/src/pmon/include -I/usr/local/src/broadcom/src/pmon/../include -DPMCC -DDBG -DDMA -DPMON -DBCM47XX -DALGOR -DINC_CMD_INT -m4710a0kern -x assembler-with-cpp -c -o longjmp.o longjmp.s
/usr/local/src/broadcom/opt/brcm/hndtools-mipsel-linux/bin/../lib/gcc-lib/mipsel-linux/3.0/../../../../mipsel-linux/bin/as: error while loading shared libraries: libopcodes-2.11.90.so: cannot open shared object file: No such file or directory
make[2]: *** [longjmp.o] Error 1
libopcodes-2.11.90.so is in my path, permissions are set but the compiler can't find it.
Any ideas ?
Cheers
Martin
after using my WL-HDD for 2 weeks, I turned to modifying the firmware.
I unpacked the source under Suse 9.1 in my /usr/local/src Directory and corrected all missing links. I also added the ....../bin and ..../lib path to my PATH.
When I run make I keep getting this error:
make[2]: Entering directory `/usr/local/src/broadcom/src/pmon/lib'
mipsel-linux-gcc -EL -G 0 -DMIPSEL -mno-abicalls -fno-pic -mcpu=r4600 -mips2 -Ulinux -fno-builtin -Os -nostdinc -I/usr/local/src/broadcom/src/pmon/include -I/usr/local/src/broadcom/src/pmon/../include -DPMCC -DDBG -DDMA -DPMON -DBCM47XX -DALGOR -DINC_CMD_INT -m4710a0kern -x assembler-with-cpp -c -o longjmp.o longjmp.s
/usr/local/src/broadcom/opt/brcm/hndtools-mipsel-linux/bin/../lib/gcc-lib/mipsel-linux/3.0/../../../../mipsel-linux/bin/as: error while loading shared libraries: libopcodes-2.11.90.so: cannot open shared object file: No such file or directory
make[2]: *** [longjmp.o] Error 1
libopcodes-2.11.90.so is in my path, permissions are set but the compiler can't find it.
Any ideas ?
Cheers
Martin